[En-Nut-Discussion] stm32-comStick build failed

Harald Kipp harald.kipp at egnite.de
Thu Sep 12 14:03:44 CEST 2013


When trying to build stm32-comStick-cm3-gcc-bld.conf from trunk, make
all terminates with

arm-none-eabi-gcc -c -I../../stm32-comStick-cm3-gcc-bld/include
-I../.././nut/include  -DSTM32_COMSTICK -DSTM32F10X_CL  -MD -MP
-mcpu=cortex-m3 -mthumb -mlittle-endian -D__CORTEX__
-ffunction-sections -fdata-sections -fomit-frame-pointer
-mfix-cortex-m3-ldrd -Os -Wall -Wstrict-prototypes -Werror
-Wa,-a=cm3/dev/stm/stm32_owitimer.lst  -o cm3/dev/stm/stm32_owitimer.o
../.././nut/arch/cm3/dev/stm/stm32_owitimer.c: In function
../.././nut/arch/cm3/dev/stm/stm32_owitimer.c:250:2: error: #warning Pin
Setting for F1 not yet implemented [-Werror=cpp]
cc1.exe: all warnings being treated as errors
make[1]: *** [cm3/dev/stm/stm32_owitimer.o] Error 1
make[1]: Leaving directory
make: *** [all] Error 2

Any clue what I can do to fix this?



More information about the En-Nut-Discussion mailing list